Target
Stromelysin-1
Ligand
BDBM50043809
Substrate
Meas. Tech.
ChEMBL_205499 (CHEMBL810391)
IC50
86000±n/a nM
Citation
 Ye, QZJohnson, LLNordan, IHupe, DHupe, L A recombinant human stromelysin catalytic domain identifying tryptophan derivatives as human stromelysin inhibitors. J Med Chem 37:206-9 (1994)  
Target
Name:
Stromelysin-1
Synonyms:
MMP-3 MMP3_HUMAN Matrix metalloproteinase 3 Matrix metalloproteinase-3 (MMP-3) SL-1 Stromelysin 1 | Transin-1
Type:
Enzyme
Mol. Mass.:
53973.13
Organism:
Homo sapiens (Human)
Description:
P08254
Residue:
477
  
Inhibitor
Name:
BDBM50043809
Synonyms:
(R)-2-Benzyloxycarbonylamino-3-(1H-indol-3-yl)-propionic acid Cbz-D-Trp
Type:
Small organic molecule
Emp. Form.:
C19H18N2O4
Mol. Mass.:
338.3572
SMILES:
OC(=O)[C@@H](Cc1c[nH]c2ccccc12)NC(=O)OCc1ccccc1
: