Target
Stromelysin-1
Ligand
BDBM50043804
Substrate
Meas. Tech.
ChEMBL_205624 (CHEMBL812383)
Ki
13±n/a nM
Citation
 Ye, QZJohnson, LLNordan, IHupe, DHupe, L A recombinant human stromelysin catalytic domain identifying tryptophan derivatives as human stromelysin inhibitors. J Med Chem 37:206-9 (1994)  
Target
Name:
Stromelysin-1
Synonyms:
MMP-3 MMP3_HUMAN Matrix metalloproteinase 3 Matrix metalloproteinase-3 (MMP-3) SL-1 Stromelysin 1 | Transin-1
Type:
Enzyme
Mol. Mass.:
53973.13
Organism:
Homo sapiens (Human)
Description:
P08254
Residue:
477
  
Inhibitor
Name:
BDBM50043804
Synonyms:
5-(2-Amino-3-phenyl-propionylamino)-3-isobutyl-7-methyl-4-oxo-octanoic acid hydroxyamide | CHEMBL440124
Type:
Small organic molecule
Emp. Form.:
C22H35N3O4
Mol. Mass.:
405.531
SMILES:
CC(C)CC(CC(=O)NO)C(=O)C(CC(C)C)NC(=O)C(N)Cc1ccccc1
: