Target
5-hydroxytryptamine receptor 2C
Ligand
BDBM50076216
Substrate
Meas. Tech.
ChEMBL_1295077 (CHEMBL3129452)
Ki
3.0±n/a nM
Citation
 Neelamegam, RHellenbrand, TSchroeder, FAWang, CHooker, JM Imaging evaluation of 5HT2C agonists, [(11)C]WAY-163909 and [(11)C]vabicaserin, formed by Pictet-Spengler cyclization. J Med Chem 57:1488-94 (2014)  
Target
Name:
5-hydroxytryptamine receptor 2C
Synonyms:
5-HT-1C 5-HT1C 5-HT2C-INI 5-HTR2C 5-hydroxytryptamine receptor 2C (5-HT-2C) 5HT-1C HTR1C Serotonin (5-HT3) receptor Serotonin Receptor 2C
Type:
G Protein-Coupled Receptor (GPCR)
Mol. Mass.:
51836.79
Organism:
Homo sapiens (Human)
Description:
P28335
Residue:
458
  
Inhibitor
Name:
BDBM50076216
Synonyms:
Vabicaserin
Type:
Small organic molecule
Emp. Form.:
C15H20N2
Mol. Mass.:
228.3327
SMILES:
[H][C@@]12CCC[C@]1([H])c1cccc3CNCCN(C2)c13
: