Target
TP53-binding protein 1
Ligand
BDBM50440614
Substrate
Meas. Tech.
ChEMBL_1300217 (CHEMBL3136681)
IC50
13700±n/a nM
Citation
 Camerino, MAZhong, NDong, ADickson, BMJames, LIBaughman, BMNorris, JLKireev, DBJanzen, WPArrowsmith, CHFrye, SV The structure-activity relationships of L3MBTL3 inhibitors: flexibility of the dimer interface. Medchemcomm 4:1501-1507 (2013)  
Target
Name:
TP53-binding protein 1
Synonyms:
53BP1 TP53BP1 Tumor suppressor p53-binding protein 1 p53BP1
Type:
PROTEIN
Mol. Mass.:
213442.98
Organism:
Homo sapiens (Human)
Description:
ChEMBL_107658
Residue:
1972
  
Inhibitor
Name:
BDBM50440614
Synonyms:
CHEMBL2426364
Type:
Small organic molecule
Emp. Form.:
C32H43N5O2
Mol. Mass.:
529.7161
SMILES:
O=C(N1CCC(CC1)N1CCCC1)c1ccc(C(=O)N2CCC(CC2)N2CCCC2)c(Nc2ccccc2)c1
: