Target
P2Y purinoceptor 12
Ligand
BDBM50044210
Substrate
Meas. Tech.
ChEBML_223118
IC50
850.0±n/a nM
Citation
 Morris, JWishka, DGLin, AHHumphrey, WRWiltse, ALGammill, RBJudge, TMBisaha, SNOlds, NLJacob, CS Synthesis and biological evaluation of antiplatelet 2-aminochromones. J Med Chem 36:2026-32 (1993)  
Target
Name:
P2Y purinoceptor 12
Synonyms:
ADP-glucose receptor HORK3 P2T(AC) P2Y(AC) P2Y(cyc) P2Y12 platelet ADP receptor Purinergic receptor P2Y12 | SP1999
Type:
Enzyme
Mol. Mass.:
39458.48
Organism:
Homo sapiens (Human)
Description:
Q9H244
Residue:
342
  
Inhibitor
Name:
BDBM50044210
Synonyms:
7-[2-(4-methylpiperazin-1-yl)ethoxy]-8-methyl-2-morpholinyl chromone 8-methyl-7-(2-(4-methylpiperazin-1-yl)ethoxy)-2-morpholino-4H-chromen-4-one | CHEMBL59941
Type:
Small organic molecule
Emp. Form.:
C21H29N3O4
Mol. Mass.:
387.4727
SMILES:
CN1CCN(CCOc2ccc3c(oc(cc3=O)N3CCOCC3)c2C)CC1
: