Target
P2Y purinoceptor 12
Ligand
BDBM50044219
Substrate
Meas. Tech.
ChEBML_223118
IC50
1400±n/a nM
Citation
 Morris, JWishka, DGLin, AHHumphrey, WRWiltse, ALGammill, RBJudge, TMBisaha, SNOlds, NLJacob, CS Synthesis and biological evaluation of antiplatelet 2-aminochromones. J Med Chem 36:2026-32 (1993)  
Target
Name:
P2Y purinoceptor 12
Synonyms:
ADP-glucose receptor HORK3 P2T(AC) P2Y(AC) P2Y(cyc) P2Y12 platelet ADP receptor Purinergic receptor P2Y12 | SP1999
Type:
Enzyme
Mol. Mass.:
39458.48
Organism:
Homo sapiens (Human)
Description:
Q9H244
Residue:
342
  
Inhibitor
Name:
BDBM50044219
Synonyms:
6,8-Dimethyl-7-[2-(4-methyl-piperazin-1-yl)-ethoxy]-2-morpholin-4-yl-chromen-4-one | CHEMBL63016
Type:
Small organic molecule
Emp. Form.:
C22H31N3O4
Mol. Mass.:
401.4992
SMILES:
CN1CCN(CCOc2c(C)cc3c(oc(cc3=O)N3CCOCC3)c2C)CC1
: