Target
Lysophosphatidic acid receptor 1
Ligand
BDBM50496698
Substrate
Meas. Tech.
ChEMBL_1329163 (CHEMBL3225179)
Ki
84±n/a nM
Citation
 East, JECarter, KMKennedy, PCSchulte, NAToews, MLLynch, KRMacdonald, TL Development of a phosphatase-resistant, L-tyrosine derived LPA1/LPA3 dual antagonist. Medchemcomm 2:325-330 (2011)  
Target
Name:
Lysophosphatidic acid receptor 1
Synonyms:
EDG2 LPA-1 LPAR1 Lysophosphatidic acid receptor 1 (LPA1) | Lysophosphatidic acid receptor Edg-2
Type:
Enzyme
Mol. Mass.:
41120.55
Organism:
Homo sapiens (Human)
Description:
Q92633
Residue:
364
  
Inhibitor
Name:
BDBM50496698
Synonyms:
CHEMBL3218459
Type:
Small organic molecule
Emp. Form.:
C35H54F3N2O7P
Mol. Mass.:
702.7814
SMILES:
CCCCCCCCCCCCCCCCCC(=O)N[C@@H](COP(O)(O)=O)Cc1ccc(OCc2cc(OCC(F)(F)F)ccn2)cc1
: