Target
2-amino-4-hydroxy-6-hydroxymethyldihydropteridine pyrophosphokinase
Ligand
BDBM50497031
Substrate
Meas. Tech.
ChEMBL_1335026 (CHEMBL3239457)
Kd
7500±n/a nM
Citation
 Yun, MKHoagland, DKumar, GWaddell, MBRock, COLee, REWhite, SW The identification, analysis and structure-based development of novel inhibitors of 6-hydroxymethyl-7,8-dihydropterin pyrophosphokinase. Bioorg Med Chem 22:2157-65 (2014)  
Target
Name:
2-amino-4-hydroxy-6-hydroxymethyldihydropteridine pyrophosphokinase
Synonyms:
2-amino-4-hydroxy-6-hydroxymethyldihydropteridine pyrophosphokinase 7,8-dihydro-6-hydroxymethylpterin-pyrophosphokinase HPPK_ECOLI PPPK | folK
Type:
PROTEIN
Mol. Mass.:
18075.55
Organism:
Escherichia coli (strain K12)
Description:
ChEMBL_108237
Residue:
159
  
Inhibitor
Name:
BDBM50497031
Synonyms:
CHEBI:62462 | Isoguanine
Type:
Small organic molecule
Emp. Form.:
C5H5N5O
Mol. Mass.:
151.1261
SMILES:
Nc1nc(=O)[nH]c2nc[nH]c12
: