Target
Beta-1/Beta-2/Beta-3 adrenergic receptor
Ligand
BDBM50042998
Substrate
Meas. Tech.
ChEMBL_1340541 (CHEMBL3254965)
EC50
2000±n/a nM
Citation
 Kirk, KLCantacuzene, DNimitkitpaisan, YMcCulloh, DPadgett, WLDaly, JWCreveling, CR Synthesis and biological properties of 2-, 5-, and 6-fluoronorepinephrines. J Med Chem 22:1493-7 (1979)  
Target
Name:
Beta-1/Beta-2/Beta-3 adrenergic receptor
Synonyms:
Adrenergic receptor beta
Type:
Mol. Mass.:
Description:
ASSAY_ID of ChEMBL is 1340543
Components:
This complex has 3 components.
Component 1
Name:
Beta-1 adrenergic receptor
Synonyms:
ADRB1R, B1AR Adrb1 Adrenergic receptor beta Beta-1 adrenoreceptor adrenergic Beta1,2
Type:
Protein
Mol. Mass.:
50486.84
Organism:
Rattus norvegicus (Rat)
Description:
P18090
Residue:
466
  
Component 2
Name:
Beta-2 adrenergic receptor
Synonyms:
ADRB2_RAT Adrb2r | Adrenergic receptor beta
Type:
PROTEIN
Mol. Mass.:
46896.26
Organism:
Rattus norvegicus
Description:
ChEMBL_38603
Residue:
418
  
Component 3
Name:
Beta-3 adrenergic receptor
Synonyms:
ADRB3_RAT Adrb3r Beta-3 adrenergic receptor
Type:
PROTEIN
Mol. Mass.:
43161.83
Organism:
Rattus norvegicus
Description:
ChEMBL_1509452
Residue:
400
  
Inhibitor
Name:
BDBM50042998
Synonyms:
5-(2-Amino-1-hydroxy-ethyl)-3-fluoro-benzene-1,2-diol(5-FNE) | CHEMBL129190
Type:
Small organic molecule
Emp. Form.:
C8H10FNO3
Mol. Mass.:
187.1683
SMILES:
NCC(O)c1cc(O)c(O)c(F)c1
: