Target
Beta-1/Beta-2/Beta-3 adrenergic receptor
Ligand
BDBM50497052
Substrate
Meas. Tech.
ChEMBL_1341440 (CHEMBL3253160)
IC50
0.045000±n/a nM
Citation
 Condon, MECimarusti, CMFox, RNarayanan, VLReid, JSundeen, JEHauck, FP Nondepressant beta-adrenergic blocking agents. 1. Substituted 3-amino-1-(5,6,7,8-tetrahydro-1-naphthoxy)-2-propanols. J Med Chem 21:913-22 (1978)  
Target
Name:
Beta-1/Beta-2/Beta-3 adrenergic receptor
Synonyms:
Adrenergic receptor beta
Type:
Mol. Mass.:
Description:
ASSAY_ID of ChEMBL is 1340543
Components:
This complex has 3 components.
Component 1
Name:
Beta-1 adrenergic receptor
Synonyms:
ADRB1R, B1AR Adrb1 Adrenergic receptor beta Beta-1 adrenoreceptor adrenergic Beta1,2
Type:
Protein
Mol. Mass.:
50486.84
Organism:
Rattus norvegicus (Rat)
Description:
P18090
Residue:
466
  
Component 2
Name:
Beta-2 adrenergic receptor
Synonyms:
ADRB2_RAT Adrb2r | Adrenergic receptor beta
Type:
PROTEIN
Mol. Mass.:
46896.26
Organism:
Rattus norvegicus
Description:
ChEMBL_38603
Residue:
418
  
Component 3
Name:
Beta-3 adrenergic receptor
Synonyms:
ADRB3_RAT Adrb3r Beta-3 adrenergic receptor
Type:
PROTEIN
Mol. Mass.:
43161.83
Organism:
Rattus norvegicus
Description:
ChEMBL_1509452
Residue:
400
  
Inhibitor
Name:
BDBM50497052
Synonyms:
CHEMBL3246792
Type:
Small organic molecule
Emp. Form.:
C23H31NO4
Mol. Mass.:
385.4965
SMILES:
CC(C)(Cc1ccccc1)NCC(O)COc1cccc2C[C@@H](O)[C@@H](O)Cc12
: