Target
Protease
Ligand
BDBM50497085
Substrate
Meas. Tech.
ChEMBL_1349799 (CHEMBL3268000)
IC50
169±n/a nM
Citation
 Qiu, XZhao, GDTang, LQLiu, ZP Design and synthesis of highly potent HIV-1 protease inhibitors with novel isosorbide-derived P2 ligands. Bioorg Med Chem Lett 24:2465-8 (2014)  
Target
Name:
Protease
Synonyms:
Type:
Enzyme
Mol. Mass.:
10904.79
Organism:
Human immunodeficiency virus 1 (HIV-1)
Description:
Q9YQ12
Residue:
99
  
Inhibitor
Name:
BDBM50497085
Synonyms:
CHEMBL3263093
Type:
Small organic molecule
Emp. Form.:
C27H37N3O8S
Mol. Mass.:
563.663
SMILES:
[H][C@]12OC[C@H](OC(=O)N[C@@H](Cc3ccccc3)[C@H](O)CN(CC(C)C)S(=O)(=O)c3ccc(N)cc3)[C@@]1([H])OC[C@H]2O
: