Target
Protease
Ligand
BDBM50067593
Substrate
Meas. Tech.
ChEMBL_1349796 (CHEMBL3267997)
IC50
<10.0±n/a nM
Citation
 Qiu, XZhao, GDTang, LQLiu, ZP Design and synthesis of highly potent HIV-1 protease inhibitors with novel isosorbide-derived P2 ligands. Bioorg Med Chem Lett 24:2465-8 (2014)  
Target
Name:
Protease
Synonyms:
Type:
Enzyme
Mol. Mass.:
10904.79
Organism:
Human immunodeficiency virus 1 (HIV-1)
Description:
Q9YQ12
Residue:
99
  
Inhibitor
Name:
BDBM50067593
Synonyms:
CHEBI:44032 Indinavir MK-639 | US10806794, Compound Indinavir
Type:
Small organic molecule
Emp. Form.:
C36H47N5O4
Mol. Mass.:
613.7895
SMILES:
CC(C)(C)NC(=O)[C@@H]1CN(Cc2cccnc2)CCN1C[C@@H](O)C[C@@H](Cc1ccccc1)C(=O)N[C@@H]1[C@H](O)Cc2ccccc12
: