Target
G protein-activated inward rectifier potassium channel 1
Ligand
BDBM50497367
Substrate
Meas. Tech.
ChEMBL_1443114 (CHEMBL3380820)
EC50
310±n/a nM
Citation
 Wen, WWu, WWeaver, CDLindsley, CW Discovery of potent and selective GIRK1/2 modulators via 'molecular switches' within a series of 1-(3-cyclopropyl-1-phenyl-1H-pyrazol-5-yl)ureas. Bioorg Med Chem Lett 24:5102-6 (2014)  
Target
Name:
G protein-activated inward rectifier potassium channel 1
Synonyms:
GIRK-1 Inward rectifier K(+) channel Kir3.1 KCNJ3_HUMAN | Potassium channel, inwardly rectifying subfamily J member 3
Type:
PROTEIN
Mol. Mass.:
56610.74
Organism:
Homo sapiens (Human)
Description:
ChEMBL_107915
Residue:
501
  
Inhibitor
Name:
BDBM50497367
Synonyms:
CHEMBL3339146
Type:
Small organic molecule
Emp. Form.:
C17H16F6N4O
Mol. Mass.:
406.3256
SMILES:
CC1CC1c1cc(NC(=O)Nc2ccc(cc2)C(F)(F)F)n(CC(F)(F)F)n1
: