Target
5-hydroxytryptamine receptor 7
Ligand
BDBM50045488
Substrate
Meas. Tech.
ChEMBL_1440701 (CHEMBL3381336)
Ki
4.3±n/a nM
Citation
 Moritomo, AYamada, HMatsuzawa-Nomura, TWatanabe, TItahana, HOku, MAkuzawa, SOkada, M Synthesis and pharmacological evaluation of optically pure, novel carbonyl guanidine derivatives as dual 5-HT2B and 5-HT7 receptor antagonists. Bioorg Med Chem 22:6026-38 (2014)  
Target
Name:
5-hydroxytryptamine receptor 7
Synonyms:
5-HT-7 5-HT7 5-HT7S 5HT7 HTR7 | Serotonin receptor 7
Type:
G Protein-Coupled Receptor (GPCR)
Mol. Mass.:
53573.08
Organism:
Homo sapiens (Human)
Description:
P34969
Residue:
479
  
Inhibitor
Name:
BDBM50045488
Synonyms:
CHEMBL3310123
Type:
Small organic molecule
Emp. Form.:
C16H16ClN3O2
Mol. Mass.:
317.77
SMILES:
Cl.[#6]C1([#8])c2ccccc2-c2ccc(cc12)-[#6](=O)\[#7]=[#6](\[#7])-[#7]
: