Target
5-hydroxytryptamine receptor 2B
Ligand
BDBM50045488
Substrate
Meas. Tech.
ChEMBL_1440700 (CHEMBL3381335)
Ki
4.3±n/a nM
Citation
 Moritomo, AYamada, HMatsuzawa-Nomura, TWatanabe, TItahana, HOku, MAkuzawa, SOkada, M Synthesis and pharmacological evaluation of optically pure, novel carbonyl guanidine derivatives as dual 5-HT2B and 5-HT7 receptor antagonists. Bioorg Med Chem 22:6026-38 (2014)  
Target
Name:
5-hydroxytryptamine receptor 2B
Synonyms:
5-HT-2B 5-hydroxytryptamine (serotonin) receptor 2B [Homo sapiens] 5-hydroxytryptamine receptor 2C (5HT2C) HTR2B Serotonin 2b (5-HT2b) receptor | Serotonin Receptor 2B
Type:
G Protein-Coupled Receptor (GPCR)
Mol. Mass.:
54312.47
Organism:
Homo sapiens (Human)
Description:
Receptor binding assays were performed using human clone stably expressed in CHO cells.
Residue:
481
  
Inhibitor
Name:
BDBM50045488
Synonyms:
CHEMBL3310123
Type:
Small organic molecule
Emp. Form.:
C16H16ClN3O2
Mol. Mass.:
317.77
SMILES:
Cl.[#6]C1([#8])c2ccccc2-c2ccc(cc12)-[#6](=O)\[#7]=[#6](\[#7])-[#7]
: