Target
5-hydroxytryptamine receptor 2B
Ligand
BDBM50497428
Substrate
Meas. Tech.
ChEMBL_1440700 (CHEMBL3381335)
Ki
5.1±n/a nM
Citation
 Moritomo, AYamada, HMatsuzawa-Nomura, TWatanabe, TItahana, HOku, MAkuzawa, SOkada, M Synthesis and pharmacological evaluation of optically pure, novel carbonyl guanidine derivatives as dual 5-HT2B and 5-HT7 receptor antagonists. Bioorg Med Chem 22:6026-38 (2014)  
Target
Name:
5-hydroxytryptamine receptor 2B
Synonyms:
5-HT-2B 5-hydroxytryptamine (serotonin) receptor 2B [Homo sapiens] 5-hydroxytryptamine receptor 2C (5HT2C) HTR2B Serotonin 2b (5-HT2b) receptor | Serotonin Receptor 2B
Type:
G Protein-Coupled Receptor (GPCR)
Mol. Mass.:
54312.47
Organism:
Homo sapiens (Human)
Description:
Receptor binding assays were performed using human clone stably expressed in CHO cells.
Residue:
481
  
Inhibitor
Name:
BDBM50497428
Synonyms:
CHEMBL3343673
Type:
Small organic molecule
Emp. Form.:
C18H17N3O2
Mol. Mass.:
307.3465
SMILES:
[#7]\[#6](-[#7])=[#7]\[#6](=O)-c1ccc2-c3ccccc3[C@]3([#6]-[#6]-[#6]-[#8]3)c2c1
: