Target
5-hydroxytryptamine receptor 2B
Ligand
BDBM50497432
Substrate
Meas. Tech.
ChEMBL_1440700 (CHEMBL3381335)
Ki
1.7±n/a nM
Citation
 Moritomo, AYamada, HMatsuzawa-Nomura, TWatanabe, TItahana, HOku, MAkuzawa, SOkada, M Synthesis and pharmacological evaluation of optically pure, novel carbonyl guanidine derivatives as dual 5-HT2B and 5-HT7 receptor antagonists. Bioorg Med Chem 22:6026-38 (2014)  
Target
Name:
5-hydroxytryptamine receptor 2B
Synonyms:
5-HT-2B 5-hydroxytryptamine (serotonin) receptor 2B [Homo sapiens] 5-hydroxytryptamine receptor 2C (5HT2C) HTR2B Serotonin 2b (5-HT2b) receptor | Serotonin Receptor 2B
Type:
G Protein-Coupled Receptor (GPCR)
Mol. Mass.:
54312.47
Organism:
Homo sapiens (Human)
Description:
Receptor binding assays were performed using human clone stably expressed in CHO cells.
Residue:
481
  
Inhibitor
Name:
BDBM50497432
Synonyms:
CHEMBL3343669
Type:
Small organic molecule
Emp. Form.:
C19H20ClN3O
Mol. Mass.:
341.835
SMILES:
Cl.[#7]\[#6](-[#7])=[#7]\[#6](=O)-c1ccc2-c3ccccc3C3([#6]-[#6]-[#6]-[#6]3)c2c1
: