Target
Delta-type opioid receptor
Ligand
BDBM50045775
Substrate
Meas. Tech.
ChEBML_217864
Ki
5.2±n/a nM
Citation
 Mitch, CHLeander, JDMendelsohn, LGShaw, WNWong, DTCantrell, BEJohnson, BGReel, JKSnoddy, JDTakemori, AE 3,4-Dimethyl-4-(3-hydroxyphenyl)piperidines: opioid antagonists with potent anorectant activity. J Med Chem 36:2842-50 (1993)  
Target
Name:
Delta-type opioid receptor
Synonyms:
Cytochrome P450 3A4 Delta opioid receptor Delta-type opioid receptor (DOR) OPRD_RAT Opioid receptor Opioid receptors; mu & delta Ror-a | Voltage-gated potassium channel
Type:
G Protein-Coupled Receptor (GPCR)
Mol. Mass.:
40465.04
Organism:
Rattus norvegicus (rat)
Description:
Competition binding assays were using CHO-K1 cell membranes expressing the opioid receptor.
Residue:
372
  
Inhibitor
Name:
BDBM50045775
Synonyms:
(3R,4R)3-[1-(3-Cyclohexyl-3-hydroxy-propyl)-3,4-dimethyl-piperidin-4-yl]-phenol 3-[(3R,4R)-1-((S)-3-Cyclohexyl-3-hydroxy-propyl)-3,4-dimethyl-piperidin-4-yl]-phenol CHEMBL300662 | LY-255582
Type:
Small organic molecule
Emp. Form.:
C22H35NO2
Mol. Mass.:
345.5188
SMILES:
C[C@H]1CN(CC[C@H](O)C2CCCCC2)CC[C@@]1(C)c1cccc(O)c1
: