Target
Translocator protein
Ligand
BDBM50045870
Substrate
Meas. Tech.
ChEBML_218704
Ki
66±n/a nM
Citation
 Kozikowski, APMa, DBrewer, JSun, SCosta, ERomeo, EGuidotti, A Chemistry, binding affinities, and behavioral properties of a new class of"antineophobic" mitochondrial DBI receptor complex (mDRC) ligands. J Med Chem 36:2908-20 (1993)  
Target
Name:
Translocator protein
Synonyms:
Benzodiazepine receptors; peripheral & central Mbr PBR Peripheral benzodiazepine receptor (PBR) TSPO_RAT | Tspo
Type:
Mitochondrion membrane protein
Mol. Mass.:
18945.84
Organism:
Rattus norvegicus (rat)
Description:
Competitive binding experiments were performed on rat kidney mitochondrial membranes.
Residue:
169
  
Inhibitor
Name:
BDBM50045870
Synonyms:
2-(5-Methyl-2-p-tolyl-1H-indol-3-yl)-N,N-dipropyl-acetamide | CHEMBL100103
Type:
Small organic molecule
Emp. Form.:
C24H30N2O
Mol. Mass.:
362.5078
SMILES:
CCCN(CCC)C(=O)Cc1c([nH]c2ccc(C)cc12)-c1ccc(C)cc1
: