Target
Gastrin/cholecystokinin type B receptor
Ligand
BDBM50045870
Substrate
Meas. Tech.
ChEBML_216877
IC50
>1000±n/a nM
Citation
 Kozikowski, APMa, DBrewer, JSun, SCosta, ERomeo, EGuidotti, A Chemistry, binding affinities, and behavioral properties of a new class of"antineophobic" mitochondrial DBI receptor complex (mDRC) ligands. J Med Chem 36:2908-20 (1993)  
Target
Name:
Gastrin/cholecystokinin type B receptor
Synonyms:
Cckbr Cholecystokinin B receptor GASR_RAT | Gastrin/cholecystokinin type B receptor
Type:
Enzyme Catalytic Domain
Mol. Mass.:
48980.43
Organism:
RAT
Description:
Cholecystokinin A CCKBR RAT::P30553
Residue:
452
  
Inhibitor
Name:
BDBM50045870
Synonyms:
2-(5-Methyl-2-p-tolyl-1H-indol-3-yl)-N,N-dipropyl-acetamide | CHEMBL100103
Type:
Small organic molecule
Emp. Form.:
C24H30N2O
Mol. Mass.:
362.5078
SMILES:
CCCN(CCC)C(=O)Cc1c([nH]c2ccc(C)cc12)-c1ccc(C)cc1
: