Target
Beta-1/Beta-2/Beta-3 adrenergic receptor
Ligand
BDBM50045870
Substrate
Meas. Tech.
ChEMBL_215873 (CHEMBL821283)
IC50
>1000±n/a nM
Citation
 Kozikowski, APMa, DBrewer, JSun, SCosta, ERomeo, EGuidotti, A Chemistry, binding affinities, and behavioral properties of a new class of"antineophobic" mitochondrial DBI receptor complex (mDRC) ligands. J Med Chem 36:2908-20 (1993)  
Target
Name:
Beta-1/Beta-2/Beta-3 adrenergic receptor
Synonyms:
Adrenergic receptor beta
Type:
Mol. Mass.:
Description:
ASSAY_ID of ChEMBL is 1340543
Components:
This complex has 3 components.
Component 1
Name:
Beta-1 adrenergic receptor
Synonyms:
ADRB1R, B1AR Adrb1 Adrenergic receptor beta Beta-1 adrenoreceptor adrenergic Beta1,2
Type:
Protein
Mol. Mass.:
50486.84
Organism:
Rattus norvegicus (Rat)
Description:
P18090
Residue:
466
  
Component 2
Name:
Beta-2 adrenergic receptor
Synonyms:
ADRB2_RAT Adrb2r | Adrenergic receptor beta
Type:
PROTEIN
Mol. Mass.:
46896.26
Organism:
Rattus norvegicus
Description:
ChEMBL_38603
Residue:
418
  
Component 3
Name:
Beta-3 adrenergic receptor
Synonyms:
ADRB3_RAT Adrb3r Beta-3 adrenergic receptor
Type:
PROTEIN
Mol. Mass.:
43161.83
Organism:
Rattus norvegicus
Description:
ChEMBL_1509452
Residue:
400
  
Inhibitor
Name:
BDBM50045870
Synonyms:
2-(5-Methyl-2-p-tolyl-1H-indol-3-yl)-N,N-dipropyl-acetamide | CHEMBL100103
Type:
Small organic molecule
Emp. Form.:
C24H30N2O
Mol. Mass.:
362.5078
SMILES:
CCCN(CCC)C(=O)Cc1c([nH]c2ccc(C)cc12)-c1ccc(C)cc1
: