Target
Friend leukemia integration 1 transcription factor/RNA-binding protein EWS
Ligand
BDBM50497658
Substrate
Meas. Tech.
ChEMBL_1440214 (CHEMBL3383759)
IC50
770±n/a nM
Citation
 Tosso, PNKong, YScher, LCummins, RSchneider, JRahim, SHolman, KTToretsky, JWang, KÜren, ABrown, ML Synthesis and structure-activity relationship studies of small molecule disruptors of EWS-FLI1 interactions in Ewing's sarcoma. J Med Chem 57:10290-303 (2014)  
Target
Name:
Friend leukemia integration 1 transcription factor/RNA-binding protein EWS
Synonyms:
Friend leukemia integration 1 transcription factor (Proto-oncogene Fli-1)/RNA-binding protein EWS
Type:
Mol. Mass.:
Description:
ASSAY_ID of ChEMBL is 1440214
Components:
This complex has 2 components.
Component 1
Name:
RNA-binding protein EWS
Synonyms:
EWS EWSR1 Ewing sarcoma breakpoint region 1 protein | RNA-binding protein EWS
Type:
PROTEIN
Mol. Mass.:
68495.63
Organism:
Homo sapiens
Description:
ChEMBL_117112
Residue:
656
  
Component 2
Name:
Friend leukemia integration 1 transcription factor
Synonyms:
FLI1 Friend leukemia integration 1 transcription factor Transcription factor ERGB
Type:
PROTEIN
Mol. Mass.:
50985.79
Organism:
Homo sapiens (Human)
Description:
ChEMBL_117112
Residue:
452
  
Inhibitor
Name:
BDBM50497658
Synonyms:
CHEMBL3360384
Type:
Small organic molecule
Emp. Form.:
C19H19NO6
Mol. Mass.:
357.3573
SMILES:
COc1ccc(cc1)C(=O)CC1(O)C(=O)Nc2c1c(OC)ccc2OC
: