Target
Friend leukemia integration 1 transcription factor
Ligand
BDBM50379275
Substrate
Meas. Tech.
ChEMBL_1440214 (CHEMBL3383759)
IC50
350±n/a nM
Citation
 Tosso, PNKong, YScher, LCummins, RSchneider, JRahim, SHolman, KTToretsky, JWang, KÜren, ABrown, ML Synthesis and structure-activity relationship studies of small molecule disruptors of EWS-FLI1 interactions in Ewing's sarcoma. J Med Chem 57:10290-303 (2014)  
Target
Name:
Friend leukemia integration 1 transcription factor
Synonyms:
FLI1 Friend leukemia integration 1 transcription factor Transcription factor ERGB
Type:
PROTEIN
Mol. Mass.:
50985.79
Organism:
Homo sapiens (Human)
Description:
ChEMBL_117112
Residue:
452
  
Inhibitor
Name:
BDBM50379275
Synonyms:
CHEMBL2011500
Type:
Small organic molecule
Emp. Form.:
C17H13Cl2NO4
Mol. Mass.:
366.195
SMILES:
COc1ccc(cc1)C(=O)CC1(O)C(=O)Nc2c1c(Cl)ccc2Cl
: