Target
Amiloride-sensitive amine oxidase [copper-containing]
Ligand
BDBM50046210
Substrate
Meas. Tech.
ChEBML_53893
IC50
870.0±n/a nM
Citation
 Stanek, JCaravatti, GCapraro, HGFuret, PMett, HSchneider, PRegenass, U S-adenosylmethionine decarboxylase inhibitors: new aryl and heteroaryl analogues of methylglyoxal bis(guanylhydrazone). J Med Chem 36:46-54 (1993)  
Target
Name:
Amiloride-sensitive amine oxidase [copper-containing]
Synonyms:
ABP Abp1 Aoc1 Diamine oxidase | Histaminase
Type:
PROTEIN
Mol. Mass.:
85028.72
Organism:
Rattus norvegicus
Description:
ChEMBL_53893
Residue:
746
  
Inhibitor
Name:
BDBM50046210
Synonyms:
6-((E)-{[(E)-amino(imino)methyl]hydrazono}methyl)pyridine-2-carboximidamide | CHEMBL148996
Type:
Small organic molecule
Emp. Form.:
C8H11N7
Mol. Mass.:
205.2198
SMILES:
NC(=N)NN=Cc1cccc(n1)C(N)=N
: