Target
Sodium channel protein type 5 subunit alpha
Ligand
BDBM50169425
Substrate
Meas. Tech.
ChEMBL_1459372 (CHEMBL3368017)
IC50
>1000±n/a nM
Citation
 Bagal, SKChapman, MLMarron, BEPrime, RStorer, RISwain, NA Recent progress in sodium channel modulators for pain. Bioorg Med Chem Lett 24:3690-9 (2014)  
Target
Name:
Sodium channel protein type 5 subunit alpha
Synonyms:
HH1 SCN5A_HUMAN Sodium channel protein type 5 subunit alpha/beta-1/beta-2 Voltage-gated sodium channel subunit alpha Nav1.5
Type:
Enzyme
Mol. Mass.:
226908.60
Organism:
Homo sapiens (Human)
Description:
Q14524
Residue:
2016
  
Inhibitor
Name:
BDBM50169425
Synonyms:
CHEMBL3341983 | US9481677, 44
Type:
Small organic molecule
Emp. Form.:
C21H12ClF2N5O4S2
Mol. Mass.:
535.931
SMILES:
Nc1noc2ccc(cc12)-c1cc(Cl)ccc1Oc1cc(F)c(cc1F)S(=O)(=O)Nc1ncns1
: