Target
Serine protease 1
Ligand
BDBM50060000
Substrate
Meas. Tech.
ChEMBL_213037 (CHEMBL816975)
IC50
18±n/a nM
Citation
 Shuman, RTRothenberger, RBCampbell, CSSmith, GFGifford-Moore, DSGesellchen, PD Highly selective tripeptide thrombin inhibitors. J Med Chem 36:314-9 (1993)  
Target
Name:
Serine protease 1
Synonyms:
Alpha-trypsin chain 1 Beta-trypsin PRSS1 TRP1 TRY1_HUMAN Thrombin & trypsin Trypsin I | Trypsin-1
Type:
Enzyme
Mol. Mass.:
26557.80
Organism:
Homo sapiens (Human)
Description:
P07477
Residue:
247
  
Inhibitor
Name:
BDBM50060000
Synonyms:
(S)-1-((R)-2-Methylamino-2-phenyl-acetyl)-pyrrolidine-2-carboxylic acid ((S)-1-formyl-4-guanidino-butyl)-amide | CHEMBL105205
Type:
Small organic molecule
Emp. Form.:
C20H30N6O3
Mol. Mass.:
402.4906
SMILES:
CN[C@@H](C(=O)N1CCC[C@H]1C(=O)N[C@@H](CCCNC(N)=N)C=O)c1ccccc1
: