Target
Prothrombin
Ligand
BDBM50046352
Substrate
Meas. Tech.
ChEMBL_208855 (CHEMBL816690)
IC50
19.0±n/a nM
Citation
 Shuman, RTRothenberger, RBCampbell, CSSmith, GFGifford-Moore, DSGesellchen, PD Highly selective tripeptide thrombin inhibitors. J Med Chem 36:314-9 (1993)  
Target
Name:
Prothrombin
Synonyms:
Activation peptide fragment 1 Coagulation factor II Prothrombin precursor Thrombin heavy chain | Thrombin light chain
Type:
Protein
Mol. Mass.:
70029.57
Organism:
Homo sapiens (Human)
Description:
P00734
Residue:
622
  
Inhibitor
Name:
BDBM50046352
Synonyms:
1-(1,2,3,4-Tetrahydro-isoquinoline-3-carbonyl)-pyrrolidine-2-carboxylic acid (1-formyl-4-guanidino-butyl)-amide | CHEMBL2370424
Type:
Small organic molecule
Emp. Form.:
C21H30N6O3
Mol. Mass.:
414.5013
SMILES:
NC(=N)NCCC[C@H](NC(=O)[C@@H]1CCCN1C(=O)[C@H]1Cc2ccccc2CN1)C=O
: