Target
Coagulation factor X
Ligand
BDBM50046360
Substrate
Meas. Tech.
ChEMBL_48968 (CHEMBL661679)
IC50
45.0±n/a nM
Citation
 Shuman, RTRothenberger, RBCampbell, CSSmith, GFGifford-Moore, DSGesellchen, PD Highly selective tripeptide thrombin inhibitors. J Med Chem 36:314-9 (1993)  
Target
Name:
Coagulation factor X
Synonyms:
Activated coagulation factor X (FXa) Coagulation factor X precursor F10 Factor X heavy chain Factor Xa Stuart-Prower factor
Type:
Enzyme
Mol. Mass.:
54726.60
Organism:
Homo sapiens (Human)
Description:
Residue:
488
  
Inhibitor
Name:
BDBM50046360
Synonyms:
CHEMBL104472 | {1-Benzyl-2-[2-(1-formyl-4-guanidino-butylcarbamoyl)-pyrrolidin-1-yl]-2-oxo-ethyl}-carbamic acid tert-butyl ester
Type:
Small organic molecule
Emp. Form.:
C25H38N6O5
Mol. Mass.:
502.6064
SMILES:
[#6]C([#6])([#6])[#8]-[#6](=O)-[#7]-[#6@H](-[#6]-c1ccccc1)-[#6](=O)-[#7]-1-[#6]-[#6]-[#6]-[#6@H]-1-[#6](=O)-[#7]-[#6@@H](-[#6]-[#6]-[#6]\[#7]=[#6](/[#7])-[#7])-[#6]=O
: