Target
Neuronal acetylcholine receptor subunit alpha-4/beta-2
Ligand
BDBM50498037
Substrate
Meas. Tech.
ChEMBL_1451534 (CHEMBL3365055)
Ki
51±n/a nM
Citation
 Strachan, JPKombo, DCMazurov, AHeemstra, RBhatti, BSAkireddy, RMurthy, SMiao, LJett, JESpeake, JBencherif, M Identification and pharmacological characterization of 3,6-diazabicyclo[3.1.1]heptane-3-carboxamides as novel ligands for the ?4?2 and ?6/?3?2?3 nicotinic acetylcholine receptors (nAChRs). Eur J Med Chem 86:60-74 (2014)  
Target
Name:
Neuronal acetylcholine receptor subunit alpha-4/beta-2
Synonyms:
Neuronal acetylcholine receptor Alpha-4/Beta-2 Neuronal acetylcholine receptor; alpha4/beta2 | nAChR subtypes alpha4 beta2
Type:
Protein
Mol. Mass.:
Description:
Components:
This complex has 2 components.
Component 1
Name:
Neuronal acetylcholine receptor subunit alpha-4
Synonyms:
ACHA4_HUMAN CHRNA4 protein Neuronal acetylcholine receptor protein alpha-4 subunit Nicotinic acetylcholine receptor alpha4/beta2/alpha5
Type:
Mol. Mass.:
69963.49
Organism:
Homo sapiens (Human)
Description:
NACHRA4
Residue:
627
  
Component 2
Name:
Neuronal acetylcholine receptor subunit beta-2
Synonyms:
ACHB2_HUMAN Neuronal acetylcholine receptor protein beta-2 subunit | Nicotinic acetylcholine receptor alpha3/beta2/alpha5
Type:
Protein
Mol. Mass.:
57020.50
Organism:
Homo sapiens (Human)
Description:
P17787
Residue:
502
  
Inhibitor
Name:
BDBM50498037
Synonyms:
CHEMBL3329535
Type:
Small organic molecule
Emp. Form.:
C11H16N2O
Mol. Mass.:
192.2575
SMILES:
O=C(C1CC=CC1)N1CC2CC(C1)N2
: