Target
Neuropeptide Y receptor type 1
Ligand
BDBM50046552
Substrate
Meas. Tech.
ChEMBL_144145 (CHEMBL750760)
Ki
>1000±n/a nM
Citation
 Kirby, DAKoerber, SCCraig, AGFeinstein, RDDelmas, LBrown, MRRivier, JE Defining structural requirements for neuropeptide Y receptors using truncated and conformationally restricted analogues. J Med Chem 36:385-93 (1993)  
Target
Name:
Neuropeptide Y receptor type 1
Synonyms:
NPY-Y1 NPY1R NPYR neuropeptide Y receptor Y1
Type:
Enzyme Catalytic Domain
Mol. Mass.:
44399.07
Organism:
Homo sapiens (Human)
Description:
NPY-Y1 NPY1R HUMAN::P25929
Residue:
384
  
Inhibitor
Name:
BDBM50046552
Synonyms:
CHEMBL2370635 | Tyr-c(Glu-Ser-Lys-Pro-(D-Ala)-Arg-His-(DDpr))-c(Lys-Asn-Leu-Ile-Glu)-Arg-Gln-Arg-Tyr
Type:
Small organic molecule
Emp. Form.:
C99H156N34O26
Mol. Mass.:
2238.5101
SMILES:
[H][C@@]12CCCN1C(=O)[C@H](CCCCN)NC(=O)[C@H](CO)NC(=O)[C@H](CCC(=O)N[C@@H](CNC(=O)[C@H](Cc1c[nH]cn1)NC(=O)[C@H](CCCN=C(N)N)NC(=O)[C@@H](C)NC2=O)C(=O)N[C@H]1CCCCNC(=O)CC[C@H](NC(=O)[C@@]([H])(NC(=O)[C@H](CC(C)C)NC(=O)[C@H](CC(N)=O)NC1=O)[C@@H](C)CC)C(=O)N[C@@H](CCCN=C(N)N)C(=O)N[C@@H](CCC(N)=O)C(=O)N[C@@H](CCCN=C(N)N)C(=O)N[C@@H](Cc1ccc(O)cc1)C(O)=O)NC(=O)[C@@H](N)Cc1ccc(O)cc1
: