Target
Neuropeptide Y receptor type 2
Ligand
BDBM50046557
Substrate
Meas. Tech.
ChEMBL_144149 (CHEMBL750764)
Ki
220±n/a nM
Citation
 Kirby, DAKoerber, SCCraig, AGFeinstein, RDDelmas, LBrown, MRRivier, JE Defining structural requirements for neuropeptide Y receptors using truncated and conformationally restricted analogues. J Med Chem 36:385-93 (1993)  
Target
Name:
Neuropeptide Y receptor type 2
Synonyms:
NPY-Y2 NPY2-R NPY2R_HUMAN Y2 receptor | neuropeptide Y receptor Y2
Type:
Enzyme Catalytic Domain
Mol. Mass.:
42734.65
Organism:
Homo sapiens (Human)
Description:
NPY-Y2 NPY2R HUMAN::P49146
Residue:
381
  
Inhibitor
Name:
BDBM50046557
Synonyms:
CHEMBL2370624 | Tyr-c(Glu-Ser-Lys-(Aca)-Arg-His-(DDpr))-Ile-Asn-Leu-Ile-Thr-Arg-Gln-Arg-Tyr
Type:
Small organic molecule
Emp. Form.:
C96H156N32O25
Mol. Mass.:
2158.4652
SMILES:
CC[C@H](C)[C@H](NC(=O)[C@H](CC(C)C)NC(=O)[C@H](CC(N)=O)NC(=O)[C@@H](NC(=O)[C@@H]1CNC(=O)[C@H](Cc2c[nH]cn2)NC(=O)[C@H](CCCN=C(N)N)NC(=O)CCCCCNC(=O)[C@H](CCCCN)NC(=O)[C@H](CO)NC(=O)[C@H](CCC(=O)N1)NC(=O)[C@@H](N)Cc1ccc(O)cc1)[C@@H](C)CC)C(=O)N[C@@H]([C@@H](C)O)C(=O)N[C@@H](CCCN=C(N)N)C(=O)N[C@@H](CCC(N)=O)C(=O)N[C@@H](CCCN=C(N)N)C(=O)N[C@@H](Cc1ccc(O)cc1)C(O)=O
: