Target
Neuropeptide Y receptor type 1
Ligand
BDBM50046559
Substrate
Meas. Tech.
ChEMBL_144145 (CHEMBL750760)
Ki
>1000±n/a nM
Citation
 Kirby, DAKoerber, SCCraig, AGFeinstein, RDDelmas, LBrown, MRRivier, JE Defining structural requirements for neuropeptide Y receptors using truncated and conformationally restricted analogues. J Med Chem 36:385-93 (1993)  
Target
Name:
Neuropeptide Y receptor type 1
Synonyms:
NPY-Y1 NPY1R NPYR neuropeptide Y receptor Y1
Type:
Enzyme Catalytic Domain
Mol. Mass.:
44399.07
Organism:
Homo sapiens (Human)
Description:
NPY-Y1 NPY1R HUMAN::P25929
Residue:
384
  
Inhibitor
Name:
BDBM50046559
Synonyms:
CHEMBL427974 | Tyr-c(Asp-Ser-Lys-Pro-(D-Ala)-Arg-His-(D-Lys))-Ile-Asn-Leu-Ile-Thr-Arg-Gln-Arg-Tyr
Type:
Small organic molecule
Emp. Form.:
C100H161N33O26
Mol. Mass.:
2241.5538
SMILES:
CC[C@@H](C)[C@@H](NC(=O)[C@@H](CC(C)C)NC(=O)[C@@H](CC(N)=O)NC(=O)[C@H](NC(=O)[C@@H]1CCCCNC(=O)C[C@H](NC(=O)[C@@H](N)Cc2ccc(O)cc2)C(=O)N[C@@H](CO)C(=O)N[C@H](CCCCN)C(=O)N2CCC[C@H]2C(=O)N[C@@H](C)C(=O)N[C@@H](CCCNC(N)=N)C(=O)N[C@H](Cc2cnc[nH]2)C(=O)N1)[C@H](C)CC)C(=O)N[C@H]([C@H](C)O)C(=O)N[C@H](CCCNC(N)=N)C(=O)N[C@H](CCC(N)=O)C(=O)N[C@H](CCCNC(N)=N)C(=O)N[C@H](Cc1ccc(O)cc1)C(O)=O
: