Target
Dopamine beta-hydroxylase
Ligand
BDBM50498342
Substrate
Meas. Tech.
ChEMBL_1502686 (CHEMBL3593060)
IC50
2000±n/a nM
Citation
 Meck, CD'Erasmo, MPHirsch, DRMurelli, RP The biology and synthesis of ?-hydroxytropolones. Medchemcomm 5:842-852 (2014)  
Target
Name:
Dopamine beta-hydroxylase
Synonyms:
DBH Dopamine beta-monooxygenase | Soluble dopamine beta-hydroxylase
Type:
PROTEIN
Mol. Mass.:
69062.68
Organism:
Homo sapiens (Human)
Description:
ChEMBL_59428
Residue:
617
  
Inhibitor
Name:
BDBM50498342
Synonyms:
CHEMBL3357560
Type:
Small organic molecule
Emp. Form.:
C7H6O3
Mol. Mass.:
138.1207
SMILES:
Oc1ccccc(O)c1=O
: