Target
Laforin
Ligand
BDBM50498446
Substrate
Meas. Tech.
ChEMBL_1506353 (CHEMBL3599432)
IC50
56000±n/a nM
Citation
 He, RBai, YYu, ZHWu, LGunawan, AMZhang, ZY Diversity-Oriented Synthesis for Novel, Selective and Drug-like Inhibitors for a Phosphatase from Mycobacterium Tuberculosis. Medchemcomm 5:1496-1499 (2014)  
Target
Name:
Laforin
Synonyms:
EPM2A LAFPTPase Laforin
Type:
Protein
Mol. Mass.:
37158.16
Organism:
Homo sapiens (Human)
Description:
O95278
Residue:
331
  
Inhibitor
Name:
BDBM50498446
Synonyms:
CHEMBL3596431
Type:
Small organic molecule
Emp. Form.:
C14H9BrN2O3S
Mol. Mass.:
365.202
SMILES:
OC(=O)c1cc2sc(Nc3cccc(Br)c3)nc2cc1O
: