Target
Transient receptor potential cation channel subfamily A member 1
Ligand
BDBM50498447
Substrate
Meas. Tech.
ChEMBL_1506392 (CHEMBL3599582)
EC50
116000±n/a nM
Citation
 Marutani, ESakaguchi, MChen, WSasakura, KLiu, JXian, MHanaoka, KNagano, TIchinose, F Cytoprotective effects of hydrogen sulfide-releasing  Medchemcomm 5:1577-1583 (2014)  
Target
Name:
Transient receptor potential cation channel subfamily A member 1
Synonyms:
Anktm1 Trpa1
Type:
PROTEIN
Mol. Mass.:
128622.74
Organism:
Rattus norvegicus
Description:
ChEMBL_1450487
Residue:
1125
  
Inhibitor
Name:
BDBM50498447
Synonyms:
Acnaveen Bensulfoid Cuticura Eskamel Meted Sastid Sulfur Soap Sulfur precipitated Sulfur, Sublimed | Sulfur, pharmaceutical
Type:
Small organic molecule
Emp. Form.:
S
Mol. Mass.:
32.065
SMILES:
[#16;v0]
: