Target
Integrase
Ligand
BDBM50498468
Substrate
Meas. Tech.
ChEMBL_1507547 (CHEMBL3599803)
IC50
41280±n/a nM
Citation
 Ferro, SDe Luca, LAgharbaoui, FEChrist, FDebyser, ZGitto, R Optimization of rhodanine scaffold for the development of protein-protein interaction inhibitors. Bioorg Med Chem 23:3208-14 (2015)  
Target
Name:
Integrase
Synonyms:
pol
Type:
PROTEIN
Mol. Mass.:
32203.43
Organism:
Human immunodeficiency virus 1
Description:
ChEMBL_106649
Residue:
288
  
Inhibitor
Name:
BDBM50498468
Synonyms:
CHEMBL3596211
Type:
Small organic molecule
Emp. Form.:
C16H17NO4S2
Mol. Mass.:
351.44
SMILES:
COc1ccc(\C=C2/SC(=S)N(C(C(C)C)C(O)=O)C2=O)cc1
: