Target
Integrase
Ligand
BDBM50498470
Substrate
Meas. Tech.
ChEMBL_1507547 (CHEMBL3599803)
IC50
43750±n/a nM
Citation
 Ferro, SDe Luca, LAgharbaoui, FEChrist, FDebyser, ZGitto, R Optimization of rhodanine scaffold for the development of protein-protein interaction inhibitors. Bioorg Med Chem 23:3208-14 (2015)  
Target
Name:
Integrase
Synonyms:
pol
Type:
PROTEIN
Mol. Mass.:
32203.43
Organism:
Human immunodeficiency virus 1
Description:
ChEMBL_106649
Residue:
288
  
Inhibitor
Name:
BDBM50498470
Synonyms:
CHEMBL3597536
Type:
Small organic molecule
Emp. Form.:
C15H15NO4S2
Mol. Mass.:
337.414
SMILES:
CC(C)C(N1C(=S)S\C(=C/c2ccc(O)cc2)C1=O)C(O)=O
: