Target
Integrase
Ligand
BDBM50455262
Substrate
Meas. Tech.
ChEMBL_1507547 (CHEMBL3599803)
IC50
>100000±n/a nM
Citation
 Ferro, SDe Luca, LAgharbaoui, FEChrist, FDebyser, ZGitto, R Optimization of rhodanine scaffold for the development of protein-protein interaction inhibitors. Bioorg Med Chem 23:3208-14 (2015)  
Target
Name:
Integrase
Synonyms:
pol
Type:
PROTEIN
Mol. Mass.:
32203.43
Organism:
Human immunodeficiency virus 1
Description:
ChEMBL_106649
Residue:
288
  
Inhibitor
Name:
BDBM50455262
Synonyms:
CHEMBL3597542
Type:
Small organic molecule
Emp. Form.:
C14H13NO4S2
Mol. Mass.:
323.387
SMILES:
COc1ccc(\C=C2/SC(=S)N(CCC(O)=O)C2=O)cc1
: