Target
Thromboxane A2 receptor
Ligand
BDBM50047055
Substrate
Meas. Tech.
ChEMBL_207650 (CHEMBL811632)
Ki
37±n/a nM
Citation
 Nicolaï, EGoyard, JBenchetrit, TTeulon, JMCaussade, FVirone, ADelchambre, CCloarec, A Synthesis and structure-activity relationships of novel benzimidazole and imidazo[4,5-b]pyridine acid derivatives as thromboxane A2 receptor antagonists. J Med Chem 36:1175-87 (1993)  
Target
Name:
Thromboxane A2 receptor
Synonyms:
Prostanoid TP receptor TBXA2R Thromboxane Thromboxane Beta
Type:
Enyzme
Mol. Mass.:
37445.28
Organism:
Homo sapiens (Human)
Description:
P21731
Residue:
343
  
Inhibitor
Name:
BDBM50047055
Synonyms:
4-[5-Fluoro-1-(4-methanesulfonyl-benzyl)-1H-benzoimidazol-2-yl]-3,3-dimethyl-butyric acid | CHEMBL418000
Type:
Small organic molecule
Emp. Form.:
C21H23FN2O4S
Mol. Mass.:
418.482
SMILES:
CC(C)(CC(O)=O)Cc1nc2cc(F)ccc2n1Cc1ccc(cc1)S(C)(=O)=O
: