Target
Thromboxane A2 receptor
Ligand
BDBM50047062
Substrate
Meas. Tech.
ChEMBL_207650 (CHEMBL811632)
Ki
23±n/a nM
Citation
 Nicolaï, EGoyard, JBenchetrit, TTeulon, JMCaussade, FVirone, ADelchambre, CCloarec, A Synthesis and structure-activity relationships of novel benzimidazole and imidazo[4,5-b]pyridine acid derivatives as thromboxane A2 receptor antagonists. J Med Chem 36:1175-87 (1993)  
Target
Name:
Thromboxane A2 receptor
Synonyms:
Prostanoid TP receptor TBXA2R Thromboxane Thromboxane Beta
Type:
Enyzme
Mol. Mass.:
37445.28
Organism:
Homo sapiens (Human)
Description:
P21731
Residue:
343
  
Inhibitor
Name:
BDBM50047062
Synonyms:
5-[1-(4-Chloro-benzyl)-5-fluoro-1H-benzoimidazol-2-yl]-4,4-dimethyl-pentanoic acid | CHEMBL17677
Type:
Small organic molecule
Emp. Form.:
C21H22ClFN2O2
Mol. Mass.:
388.863
SMILES:
CC(C)(CCC(O)=O)Cc1nc2cc(F)ccc2n1Cc1ccc(Cl)cc1
: