Target
Protease
Ligand
BDBM50498807
Substrate
Meas. Tech.
ChEMBL_1523253 (CHEMBL3632388)
Ki
0.540000±n/a nM
Citation
 Ghosh, AKTakayama, JKassekert, LAElla-Menye, JRYashchuk, SAgniswamy, JWang, YFAoki, MAmano, MWeber, ITMitsuya, H Structure-based design, synthesis, X-ray studies, and biological evaluation of novel HIV-1 protease inhibitors containing isophthalamide-derived P2-ligands. Bioorg Med Chem Lett 25:4903-4909 (2015)  
Target
Name:
Protease
Synonyms:
Type:
Enzyme
Mol. Mass.:
10904.79
Organism:
Human immunodeficiency virus 1 (HIV-1)
Description:
Q9YQ12
Residue:
99
  
Inhibitor
Name:
BDBM50498807
Synonyms:
CHEMBL3627856
Type:
Small organic molecule
Emp. Form.:
C34H44N4O6S
Mol. Mass.:
636.801
SMILES:
COc1ccc(cc1)S(=O)(=O)N(CC(C)C)C[C@@H](O)[C@H](Cc1ccccc1)NC(=O)c1cccc(c1)C(=O)N1CCN(C)CC1
: