Target
Carbonic anhydrase 2
Ligand
BDBM50028010
Substrate
Meas. Tech.
ChEMBL_1538231 (CHEMBL3737170)
Ki
35±n/a nM
Citation
 Cincinelli, AMartellini, TVullo, DSupuran, CT Anion and sulfonamide inhibition studies of an ?-carbonic anhydrase from the Antarctic hemoglobinless fish Chionodraco hamatus. Bioorg Med Chem Lett 25:5485-9 (2015)  
Target
Name:
Carbonic anhydrase 2
Synonyms:
CA-II CAC Carbonate dehydratase II Carbonic anhydrase 2 (CA-II) Carbonic anhydrase C Carbonic anhydrase II (CA-II) Carbonic anhydrase II (hCA II) | Carbonic anhydrase isoenzyme II (hCA II)
Type:
Enzyme
Mol. Mass.:
29250.71
Organism:
Homo sapiens (Human)
Description:
P00918
Residue:
260
  
Inhibitor
Name:
BDBM50028010
Synonyms:
AD-810 CI-912 Zonegran | Zonisamide
Type:
Small organic molecule
Emp. Form.:
C8H8N2O3S
Mol. Mass.:
212.226
SMILES:
OS(=N)(=O)Cc1noc2ccccc12
: