Target
D(3) dopamine receptor
Ligand
BDBM50048300
Substrate
Meas. Tech.
ChEMBL_62263 (CHEMBL675665)
Ki
3.4±n/a nM
Citation
 Wright, JLDowning, DMFeng, MRHayes, RNHeffner, TGMacKenzie, RGMeltzer, LTPugsley, TAWise, LD Identification, characterization and pharmacological profile of three metabolites of (R)-(+)-1,2,3,6-tetrahydro-4-phenyl-1-[(3-phenylcyclohexen-1- yl)methyl]pyridine (CI-1007), a dopamine autoreceptor agonist and potential antipsychotic agent. J Med Chem 38:5007-14 (1996)  
Target
Name:
D(3) dopamine receptor
Synonyms:
DOPAMINE D3 DRD3_HUMAN Dopamine D3 receptor (D3) Dopamine receptor Dopamine receptor D3
Type:
Mol. Mass.:
44243.43
Organism:
Homo sapiens (Human)
Description:
Residue:
400
  
Inhibitor
Name:
BDBM50048300
Synonyms:
4-(1-[methyl cyclohex-3-en-3-yl phenol]-1,2,3,6-tetrahydro pyridin-4-yl)phenol | CHEMBL147159
Type:
Small organic molecule
Emp. Form.:
C24H27NO2
Mol. Mass.:
361.4767
SMILES:
Oc1ccc(cc1)C1=CCN(C[C@@H]2CCC=C(C2)c2ccc(O)cc2)CC1
: