Target
D(3) dopamine receptor
Ligand
BDBM50048299
Substrate
Meas. Tech.
ChEMBL_62263 (CHEMBL675665)
Ki
16.6±n/a nM
Citation
 Wright, JLDowning, DMFeng, MRHayes, RNHeffner, TGMacKenzie, RGMeltzer, LTPugsley, TAWise, LD Identification, characterization and pharmacological profile of three metabolites of (R)-(+)-1,2,3,6-tetrahydro-4-phenyl-1-[(3-phenylcyclohexen-1- yl)methyl]pyridine (CI-1007), a dopamine autoreceptor agonist and potential antipsychotic agent. J Med Chem 38:5007-14 (1996)  
Target
Name:
D(3) dopamine receptor
Synonyms:
DOPAMINE D3 DRD3_HUMAN Dopamine D3 receptor (D3) Dopamine receptor Dopamine receptor D3
Type:
Mol. Mass.:
44243.43
Organism:
Homo sapiens (Human)
Description:
Residue:
400
  
Inhibitor
Name:
BDBM50048299
Synonyms:
4-Phenyl-1-((R)-3-phenyl-cyclohex-3-enylmethyl)-1,2,3,6-tetrahydro-pyridine CI-1007
Type:
Small organic molecule
Emp. Form.:
C24H27N
Mol. Mass.:
329.4779
SMILES:
C([C@@H]1CCC=C(C1)c1ccccc1)N1CCC(=CC1)c1ccccc1
: