Target
Puromycin-sensitive aminopeptidase
Ligand
BDBM50499704
Substrate
Meas. Tech.
ChEMBL_1543183 (CHEMBL3744907)
IC50
68810±n/a nM
Citation
 Aeluri, RGanji, RJMarapaka, AKPillalamarri, VAlla, MAddlagatta, A Highly functionalized tetrahydropyridines are cytotoxic and selective inhibitors of human puromycin sensitive aminopeptidase. Eur J Med Chem 106:26-33 (2015)  
Target
Name:
Puromycin-sensitive aminopeptidase
Synonyms:
Aminopeptidase PSA | PSA_HUMAN
Type:
PROTEIN
Mol. Mass.:
103262.98
Organism:
Homo sapiens (Human)
Description:
ChEMBL_160080
Residue:
919
  
Inhibitor
Name:
BDBM50499704
Synonyms:
CHEMBL3740158
Type:
Small organic molecule
Emp. Form.:
C31H26N4O6
Mol. Mass.:
550.5613
SMILES:
COC(=O)C1=C(CC(N(C1c1ccc(cc1)[N+]([O-])=O)c1ccccc1)c1ccc(cc1)[N+]([O-])=O)Nc1ccccc1
: