Target
Puromycin-sensitive aminopeptidase
Ligand
BDBM50499711
Substrate
Meas. Tech.
ChEMBL_1543183 (CHEMBL3744907)
IC50
98190±n/a nM
Citation
 Aeluri, RGanji, RJMarapaka, AKPillalamarri, VAlla, MAddlagatta, A Highly functionalized tetrahydropyridines are cytotoxic and selective inhibitors of human puromycin sensitive aminopeptidase. Eur J Med Chem 106:26-33 (2015)  
Target
Name:
Puromycin-sensitive aminopeptidase
Synonyms:
Aminopeptidase PSA | PSA_HUMAN
Type:
PROTEIN
Mol. Mass.:
103262.98
Organism:
Homo sapiens (Human)
Description:
ChEMBL_160080
Residue:
919
  
Inhibitor
Name:
BDBM50499711
Synonyms:
CHEMBL3741419
Type:
Small organic molecule
Emp. Form.:
C31H28ClN3O2
Mol. Mass.:
510.026
SMILES:
CCOC(=O)C1=C(CC(N(C1c1cccnc1)c1ccccc1)c1ccc(Cl)cc1)Nc1ccccc1
: