Target
Poly [ADP-ribose] polymerase 2
Ligand
BDBM50499821
Substrate
Meas. Tech.
ChEMBL_1541455 (CHEMBL3743826)
IC50
1.000000±n/a nM
Citation
 Johannes, JWAlmeida, LDaly, KFerguson, ADGrosskurth, SEGuan, HHoward, TIoannidis, SKazmirski, SLamb, MLLarsen, NALyne, PDMikule, KOgoe, CPeng, BPetteruti, PRead, JASu, NSylvester, MThroner, SWang, WWang, XWu, JYe, QYu, YZheng, XScott, DA Discovery of AZ0108, an orally bioavailable phthalazinone PARP inhibitor that blocks centrosome clustering. Bioorg Med Chem Lett 25:5743-7 (2015)  
Target
Name:
Poly [ADP-ribose] polymerase 2
Synonyms:
(ARTD2 or PARP2) ADPRTL2 PARP2_HUMAN Poly [ADP-ribose] polymerase 2 (PARP2)
Type:
Enzyme
Mol. Mass.:
66225.70
Organism:
Homo sapiens (Human)
Description:
Q9UGN5
Residue:
583
  
Inhibitor
Name:
BDBM50499821
Synonyms:
CHEMBL3740104
Type:
Small organic molecule
Emp. Form.:
C26H22N6O2
Mol. Mass.:
450.4919
SMILES:
O=C(N1CCN(CC1)c1ncccc1C#N)c1cccc(Cc2n[nH]c(=O)c3ccccc23)c1
: