Target
Poly [ADP-ribose] polymerase 1
Ligand
BDBM50499835
Substrate
Meas. Tech.
ChEMBL_1541445 (CHEMBL3743816)
EC50
>11000±n/a nM
Citation
 Johannes, JWAlmeida, LDaly, KFerguson, ADGrosskurth, SEGuan, HHoward, TIoannidis, SKazmirski, SLamb, MLLarsen, NALyne, PDMikule, KOgoe, CPeng, BPetteruti, PRead, JASu, NSylvester, MThroner, SWang, WWang, XWu, JYe, QYu, YZheng, XScott, DA Discovery of AZ0108, an orally bioavailable phthalazinone PARP inhibitor that blocks centrosome clustering. Bioorg Med Chem Lett 25:5743-7 (2015)  
Target
Name:
Poly [ADP-ribose] polymerase 1
Synonyms:
(ARTD1 or PARP1) 2.4.2.30 ADPRT ARTD1 Human diphtheria toxin-like ADP-ribosyltransferase (ARTD1 or PARP1) NT-PARP-1 PARP1 PPOL Poly [ADP-ribose] polymerase 1 (PARP) Poly [ADP-ribose] polymerase 1 (PARP1) Poly [ADP-ribose] polymerase 1, 28-kDa form Poly [ADP-ribose] polymerase 1, processed C-terminus Poly [ADP-ribose] polymerase-1 Poly(ADP-ribose) polymerase-1 (ARTD1/PARP1) Protein poly-ADP-ribosyltransferase PARP1 | Synonyms=ADPRT
Type:
Mol. Mass.:
113114.22
Organism:
Homo sapiens (Human)
Description:
P09874
Residue:
1014
  
Inhibitor
Name:
BDBM50499835
Synonyms:
CHEMBL3739469
Type:
Small organic molecule
Emp. Form.:
C23H19F3N6O2
Mol. Mass.:
468.4312
SMILES:
C[C@@H]1Cn2c(CN1C(=O)c1cccc(Cc3n[nH]c(=O)c4ccccc34)c1)nnc2C(F)(F)F
: