Target
Histone deacetylase 6
Ligand
BDBM50115661
Substrate
Meas. Tech.
ChEMBL_1541058 (CHEMBL3744289)
EC50
1100±n/a nM
Citation
 Zwick, VNurisso, ASimões-Pires, CBouchet, SMartinet, NLehotzky, AOvadi, JCuendet, MBlanquart, CBertrand, P Cross metathesis with hydroxamate and benzamide BOC-protected alkenes to access HDAC inhibitors and their biological evaluation highlighted intrinsic activity of BOC-protected dihydroxamates. Bioorg Med Chem Lett 26:154-9 (2016)  
Target
Name:
Histone deacetylase 6
Synonyms:
Cereblon/Histone deacetylase 6 HDAC6 Histone deacetylase 6 (HDAC6) KIAA0901 | ORF Names:JM21
Type:
Chromatin regulator; hydrolase; repressor
Mol. Mass.:
131381.51
Organism:
Homo sapiens (Human)
Description:
Q9UBN7
Residue:
1215
  
Inhibitor
Name:
BDBM50115661
Synonyms:
CHEMBL320497 N1,N8-dihydroxyoctanediamide Suberohydroxamic acid Suberoyl bis hydroxamic acid
Type:
Small organic molecule
Emp. Form.:
C8H16N2O4
Mol. Mass.:
204.2236
SMILES:
ONC(=O)CCCCCCC(=O)NO
: