Target
Thymidylate synthase
Ligand
BDBM50049286
Substrate
Meas. Tech.
ChEMBL_209813 (CHEMBL815678)
IC50
20±n/a nM
Citation
 Hennequin, LFBoyle, FTWardleworth, JMMarsham, PRKimbell, RJackman, AL Quinazoline antifolates thymidylate synthase inhibitors: lipophilic analogues with modification to the C2-methyl substituent. J Med Chem 39:695-704 (1996)  
Target
Name:
Thymidylate synthase
Synonyms:
TS TYSY_MOUSE | Tyms
Type:
PROTEIN
Mol. Mass.:
34957.15
Organism:
Mus musculus
Description:
ChEMBL_1340097
Residue:
307
  
Inhibitor
Name:
BDBM50049286
Synonyms:
2-{4-[(2-Aminomethyl-4-oxo-3,4-dihydro-quinazolin-6-ylmethyl)-prop-2-ynyl-amino]-benzoylamino}-succinic acid | CHEMBL159593
Type:
Small organic molecule
Emp. Form.:
C24H23N5O6
Mol. Mass.:
477.4693
SMILES:
NCc1nc2ccc(CN(CC#C)c3ccc(cc3)C(=O)NC(CC(O)=O)C(O)=O)cc2c(=O)[nH]1
: